{"text_format":"1","workbook":"xlsx","n_sheets":10,"sheets":["ReadMe","PROJ-SUM","ENV-SUM","ENV-REQUIREMENTS","ENV-PRESCRIPTIVE","ENV-UA","TA1","Target Area Adjustments","ENV-SHGC","ENV-CHK"],"not_rendered":{"charts":0,"images":1,"macros":1,"external_links":0,"defined_names":127,"comments":1,"pivot_tables":0},"unopened":[],"bounds":{"document_bytes":16777216,"sheet_cells":100000,"rows_first":2000,"rows_last":500,"rows_between":2000,"halvings":0,"cell_chars":16384,"cell_head_chars":4096},"cells_cut":0,"cells_raw":0,"read":"whole","date_system":"1900"}

{"sheet":"ReadMe","index":0,"n_rows":43,"n_cols":2,"rows_kept":43,"cut":false,"hidden":false,"merged":[[1,0,1,1],[5,0,6,0],[8,0,9,0],[12,0,18,0],[42,0,42,1],[26,0,26,1],[28,0,29,0],[30,0,31,0],[35,0,38,0],[39,0,41,0],[32,0,33,0]]}
["Instructions for Electronic Forms, pg 1"]
["2015 WSEC Compliance Forms for Commercial Buildings including R2, R3, & R4 over 3 stories and all R1 "]
[null,"Revised Oct 2017"]
[null,"     Commercial Provision Chapters 1 - 5 of the 2015 Washington State Energy Code apply to all commercial occupancies, R-2, R-3 & R4 occupancies greater than 3 stories above grade, and R-1 occupancy (all building heights)."]
["Intro","     This file, ENV15-v4.XLSM, has electronic compliance forms for general project information including Section C406, and envelope provisions as defined in Sections C101, C303, C402, C406, Chapter 5 (existing buildings) and Appendix A (default values) for Climate Zones 4c and 5b. There are two companion files: LTG15-v4.XLSM (Section C405 lighting and electrical systems), and MECH15-v4.XLSM (Section C403 and C404 mechanical and service water systems). "]
["Energy Code ","    This form is a compliance aid and is not a substitute for the full energy code text or specific jurisdiction compliance requirements. Users should refer to the code text and contact the local jurisdiction for complete information. The full 2015 WSEC code text is available for download from the NEEC website:"]
[null,"http:/www.neec.net/energy-codes"]
["Start-up","Select this file from the NEEC website to download to your computer.  When opening the file be sure to Enable Macros. "]
["Overview ","     This file is an Excel workbook that contains multiple compliance forms and resources in Excel worksheets. Each worksheet is indicated by a tab at the bottom of the screen. You may visit each worksheet by selecting it's tab.  If you cannot see these tabs, select \"Full Screen\" in Excel."]
[null,"     Most calculations are automated. Cells that display informational text and the results of calculations are write-protected and cannot be edited. "]
["Save Files ","This file is saved in the same manner as any standard Excel file.   "]
["Getting Around","     Some forms have two or more pages. Both pages are available on screen when you select the tab for a form (worksheet). Use the scroll bars to find the second page located below the first page."]
["Input Cells ","     All general project information and the date are entered once on PROJ-SUM. This information is automatically replicated on all other ENV forms. The PROJ-SUM form accompanies all other ENV forms."]
[null,"     Only input cells are accessible. If you try to edit a write-protected cell an error message will appear requesting a password.  A password IS NOT required to complete these forms. You may use the TAB key to move to the next input cell. If the TAB doesn't take you where you want to go, use your mouse to move around the form. "]
[null,"     Avoid excessively long text strings when entering information. In some cases, text that extends beyond the available space will not be visible. In most cases the text will wrap within the cell. This may force part of the form onto a new page."]
{"$rows_left_out":29}
{"sheet":"PROJ-SUM","index":1,"n_rows":42,"n_cols":9,"rows_kept":42,"cut":false,"hidden":false,"merged":[[2,1,2,2],[3,1,3,2],[4,1,4,2],[5,1,5,2],[6,1,6,2],[42,0,42,1],[17,4,17,5],[16,4,16,5],[19,0,19,1],[13,0,14,1],[16,0,17,1],[31,0,40,1],[29,1,29,2]]}
["Project Summary, pg 1",null,null,null,null,"PROJ-SUM"]
[{"$f":"ReadMe!A2","v":"2015 WSEC Compliance Forms for Commercial Buildings including R2, R3, & R4 over 3 stories and all R1 "},null,null,null,null,{"$f":"ReadMe!B3","v":"Revised Oct 2017"}]
["General Info","Project Title:",null,"1 - This title will copy onto other forms","Date","2017-01-01"]
[null,"Project Street Address:",null,null,"For Building Department Use"]
[null,"Project City, County, Zip:"]
[null,"Project Owner or Rep:"]
[null,"Jurisdiction:"]
[]
[]
["Project Description",null,null,null,null,null,null,null,4]
[]
["Occupancy Type",null,null,null,null,null,null,null,4]
[]
["Space Conditioning Categories"]
[]
{"$rows_left_out":28}
{"sheet":"ENV-SUM","index":2,"n_rows":52,"n_cols":13,"rows_kept":52,"cut":false,"hidden":false,"merged":[[46,0,46,1],[48,2,48,3],[2,2,2,4],[39,0,39,1],[3,2,3,4],[4,2,4,4],[5,2,5,4],[7,2,7,4],[33,0,33,1],[6,2,6,4],[35,2,35,6],[20,0,20,1],[31,0,31,1],[36,2,36,3],[37,2,37,3],[11,0,11,1],[12,0,12,1],[18,0,18,1],[32,0,32,1],[31,2,31,6],[32,2,32,6]]}
["Envelope Summary",null,null,null,null,null,"ENV-SUM"]
[{"$f":"ReadMe!A2","v":"2015 WSEC Compliance Forms for Commercial Buildings including R2, R3, & R4 over 3 stories and all R1 "},null,null,null,null,null,{"$f":"ReadMe!B3","v":"Revised Oct 2017"}]
["Project Info","Project Title:",{"$f":"IF('PROJ-SUM'!$D$3=\"1 - This title will copy onto other forms\",\"1 - Fill this line out on PROJ-SUM\",'PROJ-SUM'!$D$3)","v":"1 - Fill this line out on PROJ-SUM"},null,null,"Date",{"$f":"TEXT('PROJ-SUM'!$F$3,\"mm/dd/yyyy\")","v":"01/01/2017"}]
[null,"Company Name:",null,null,null,"For Building Department Use"]
[null,"Company Address:"]
[null,"Applicant Name:"]
[null,"Applicant Phone:"]
[null,"Applicant Email:"]
[]
["Project Description"]
["Envelope Project Scope"]
["Envelope Description"]
["Air Barrier Testing"]
[]
["Compliance Documentation Scope and Method"]
{"$rows_left_out":38}
{"sheet":"ENV-REQUIREMENTS","index":3,"n_rows":98,"n_cols":6,"rows_kept":98,"cut":false,"hidden":false,"merged":[[14,2,14,3],[56,0,56,1],[61,0,61,1],[97,0,97,5],[39,2,39,3],[39,4,39,5],[41,0,41,1],[41,2,41,3],[41,4,41,5],[49,2,49,3],[50,2,50,3],[51,2,51,3],[52,2,52,3],[47,2,47,3],[48,0,48,5],[53,2,53,3],[43,2,43,3],[44,2,44,3],[45,2,45,3],[46,2,46,3],[43,4,43,5],[44,4,44,5],[45,4,45,5],[46,4,46,5],[30,0,30,1],[30,2,30,5],[31,2,31,5],[36,0,36,1],[38,0,38,1],[42,0,42,5],[38,2,38,5],[40,0,40,1],[40,2,40,3],[40,4,40,5],[29,0,29,1],[18,0,18,1],[18,2,18,3],[18,4,18,5],[19,0,19,1],[23,0,23,1],[24,2,24,3],[25,2,25,3],[26,0,26,1],[26,2,26,5],[27,2,27,3],[29,2,29,3],[29,4,29,5],[12,0,12,1],[4,2,4,3],[4,4,4,5],[6,0,6,1],[6,2,6,5],[7,0,7,1],[53,4,53,5],[47,4,47,5],[49,4,49,5],[50,4,50,5],[51,4,51,5],[52,4,52,5]]}
["Envelope Requirements Summary, pg 1",null,null,null,null,"ENV-REQ"]
[{"$f":"ReadMe!A2","v":"2015 WSEC Compliance Forms for Commercial Buildings including R2, R3, & R4 over 3 stories and all R1 "},null,null,null,null,{"$f":"ReadMe!B3","v":"Revised Oct 2017"}]
["Minimum Requirements"]
["for Prescriptive Compliance"]
[null,"Prescriptive Path"," Table C402.1.3 Notes 1,7\nInsulation Minimum R-Value",null,"Table C402.1.4 Notes 1,2\nAssembly Maximum U-factor"]
[null,"Occupancy Group  ","All Other","Group R","All Other","Group R"]
["Opaque Elements"]
["Roofs"]
[null,"Insulation Entirely above Deck","R-38 c.i.","R-38 c.i.","U-0.027","U-0.027"]
[null,"Metal Building (with thermal spacer block) Note 3","R-25 + R-11 Ls","R-25 + R-11 Ls","U-0.031","U-0.031"]
[null,"Attic and Other","R-49","R-49","U-0.021","U-0.021"]
[null,"Joist or single rafter","R-49","R-49","U-0.027","U-0.027"]
["Walls, Above-grade"]
[null,"Mass","R-9.5 c.i. Note 6","R-13.3 c.i.","U-0.104 Note 6","U-0.078"]
[null,"Mass transfer deck slab edge","No R-Value for prescriptive compliance",null,"U-0.200","U-0.200"]
{"$rows_left_out":84}
{"sheet":"ENV-PRESCRIPTIVE","index":4,"n_rows":156,"n_cols":13,"rows_kept":156,"cut":false,"hidden":false,"merged":[[111,3,111,5],[111,6,111,7],[9,3,9,5],[9,6,9,7],[64,3,64,5],[64,6,64,7],[79,3,79,5],[79,6,79,7]]}
["Prescriptive Path, pg. 1",null,null,null,null,null,null,"ENV-PRESCRIPTIVE"]
[{"$f":"'ENV-SUM'!A2","v":"2015 WSEC Compliance Forms for Commercial Buildings including R2, R3, & R4 over 3 stories and all R1 "},null,null,null,null,null,null,{"$f":"'ENV-SUM'!G2","v":"Revised Oct 2017"}]
[{"$f":"'ENV-SUM'!B3","v":"Project Title:"},null,null,{"$f":"IF('PROJ-SUM'!$D$3=\"1 - This title will copy onto other forms\",\"1 - Fill this line out on PROJ-SUM\",'PROJ-SUM'!$D$3)","v":"1 - Fill this line out on PROJ-SUM"},null,null,"Date",{"$f":"TEXT('PROJ-SUM'!$F$3,\"mm/dd/yyyy\")","v":"01/01/2017"}]
["Target Insulation Allowance",null,null,null,null,null,"For Building Department Use"]
[null,null,{"$f":"IF(CompliancePath<>1,\"    Prescriptive Compliance Not Selected\",IF(CalcType=1,\"    Fully Conditioned Space - Commercial, Group R, Mixed Use\",IF(CalcType=2,\"    Semi-heated Space\",IF(CalcType=3,\"    Refrigerated Cooler - See note 16 for instructions\",IF(CalcType=4,\"    Refrigerated Freezer - See note 17 for instructions\",\"\")))))","v":"    Prescriptive Compliance Not Selected"}]
["Fenestration Area as % gross above-grade wall area",null,null,{"$f":"IF('ENV-SUM'!E31>0,'ENV-SUM'!E31,0)","v":""},"Max. Target:",{"$f":"'Target Area Adjustments'!D14","v":0.3}]
["Skylight Area as % gross roof area",null,null,{"$f":"IF('ENV-SUM'!G31>0,'ENV-SUM'!G31,0)","v":""},"Max. Target:",{"$f":"'Target Area Adjustments'!D66","v":0.05}]
["Vertical Fenestration Alternates:",null,null,null,null,{"$f":"'TA1'!A28","v":"None Selected on ENV-SUM"},"User Note"]
[]
["Building Component ",null,null,"R-Value Method for Prescriptive Compliance",null,null,"U-Factor/F-Factor Method for Prescriptive Compliance"]
[null,null,"Provide plan/detail # of assembly and description","Cavity Ins.\nR-Value","Continuous Ins. (CI)\nR-Value1","% Area of Metal Penetrations \nin CI2","Assembly \nU-Factor","U-Factor Source3                                                       "]
[]
[]
[null,null,null,null,null,null,null,null,null,null,null,null,0]
[]
{"$rows_left_out":142}
{"sheet":"ENV-UA","index":5,"n_rows":147,"n_cols":15,"rows_kept":147,"cut":false,"hidden":false,"merged":[[10,9,11,9],[10,10,11,11],[122,10,122,11],[123,10,123,11],[117,10,117,11],[118,10,118,11],[119,10,119,11],[120,10,120,11],[121,10,121,11],[99,2,99,4],[100,2,100,4],[101,2,101,4],[93,2,93,4],[94,2,94,4],[95,2,95,4],[96,2,96,4],[97,2,97,4],[98,2,98,4],[92,2,92,4],[81,2,81,4],[82,2,82,4],[83,2,83,4],[84,2,84,4],[85,2,85,4],[86,2,86,4],[87,2,87,4],[88,2,88,4],[89,2,89,4],[90,2,90,4],[91,2,91,4],[80,2,80,4],[75,2,75,4],[76,2,76,4],[77,2,77,4],[79,2,79,4],[78,2,78,4]]}
["Component Performance Path, pg. 1",null,null,null,null,null,null,null,null,null,null,"ENV-UA"]
[{"$f":"'ENV-SUM'!A2","v":"2015 WSEC Compliance Forms for Commercial Buildings including R2, R3, & R4 over 3 stories and all R1 "},null,null,null,null,null,null,null,null,null,null,{"$f":"'ENV-SUM'!G2","v":"Revised Oct 2017"}]
[{"$f":"'ENV-SUM'!B3","v":"Project Title:"},null,null,null,null,{"$f":"IF('PROJ-SUM'!$D$3=\"1 - This title will copy onto other forms\",\"1 - Fill this line out on PROJ-SUM\",'PROJ-SUM'!$D$3)","v":"1 - Fill this line out on PROJ-SUM"},null,null,null,"Date",{"$f":"TEXT('PROJ-SUM'!$F$3,\"mm/dd/yyyy\")","v":"01/01/2017"}]
["Target Insulation Allowance",null,null,null,null,null,null,null,null,"For Building Department Use"]
[null,null,null,{"$f":"IF(CompliancePath<>2,\"Component Performance Not Selected\",IF(CalcType=1,\"Fully Conditioned Space - Commercial, Group R, Mixed Use\",IF(CalcType=2,\"Semi-heated Space\",IF(CalcType=3,\"Refrigerated Cooler - See note 11 for instructions\",IF(CalcType=4,\"Refrigerated Freezer - See note 12 for instructions\",\"\")))))","v":"Component Performance Not Selected"}]
["Calculation Adjustments"]
[null,null,null,{"$f":" IF(SemiHt,IF(ChangeofUseOrConditioning,IF(C406.8_Enhanced_Envelope,\"Proposed UA shall be at least 5% lower than Target UA excluding walls\",\"Proposed UA is allowed to be 10% higher than Target UA excluding walls\"),IF(C406.8_Enhanced_Envelope,\"Proposed UA shall be at least 15% lower than Target UA excluding walls\",\"Semi-heated space - walls excluded from proposed and target total UA\")),\nIF(ChangeofUseOrConditioning,IF(C406.8_Enhanced_Envelope,\"Proposed UA shall be at least 5% lower than Target UA\",\"Proposed UA is allowed to be 10% higher than Target UA\"),IF(C406.8_Enhanced_Envelope,\"Proposed UA shall be at least 15% lower than Target UA\",\"None Applied\")))","v":"None Applied"}]
["Fenestration Area as % gross above-grade wall area",null,null,null,null,null,{"$f":"IF('ENV-SUM'!E31>0,'ENV-SUM'!E31,0)","v":""},"Max. Target:",{"$f":"'Target Area Adjustments'!D14","v":0.3}]
["Skylight Area as % gross roof area",null,null,null,null,null,{"$f":"IF('ENV-SUM'!G31>0,'ENV-SUM'!G31,0)","v":""},"Max. Target:",{"$f":"'Target Area Adjustments'!D66","v":0.05}]
["Vertical Fenestration Alternates:",null,null,null,null,null,null,null,{"$f":"'TA1'!A28","v":"None Selected on ENV-SUM"}]
[null,null,null,null,null,"Vertical Fenestration",null,"Net Wall ",null,"User Note"]
[null,null,null,null,null,"Skylights",null,"Net Roof "]
["Building Component ",null,null,null,null,null,null,"Proposed UA",null,"Target UA"]
[null,null,null,"Cavity+CI ","Plan/Detail #","U-factor Source & Table # 2","U-factor","x Area (A)","= UA (U x A)","U-factor","x Area (A) =","UA (U x A)"]
[null,null,"R=",null,null,null,null,null,{"$f":"IF(AND(G15=0,H15=0),0,IF(OR(G15=0,H15=0),NA(), H15*G15))","v":0},{"$f":"'TA1'!F132","v":2.7E-2},{"$f":"'Target Area Adjustments'!J83","v":0},{"$f":"IF(J15=\"NR\",\"NR\",IF(TYPE(J15*K15)<>1,0,J15*K15))","v":0}]
{"$rows_left_out":133}
{"sheet":"TA1","index":6,"n_rows":184,"n_cols":46,"rows_kept":184,"cut":false,"hidden":true,"merged":[]}
["HARD CODED -- NOT SET on ENV-SUM or ENV-PROJ"]
[{"$f":"IF(OR(CalcType=3,CalcType=4),2,1)","v":1},"Calculation Group: 1=Building, 2=Refrigeration"]
[1,"Climate Zone: 1= Zone 4c/5, 2=Zone 6, 3=Cleared, 4= Seattle "]
[null,null,null,null,null,null,null,null,"Addition button"]
["Transfer Variables - DO NOT CHANGE CELL ADDRESS - hard coded in VB ",null,null,null,null,null,null,null,1]
[{"$f":"'Target Area Adjustments'!F11","v":0},"Window Area",null,null,null,null,null,null,"Alteration Button"]
[{"$f":"SUM('Target Area Adjustments'!H11:J11)","v":0},"Net AG Wall Area",null,null,null,null,null,null,1]
[{"$f":"'Target Area Adjustments'!F62","v":0},"Skylight Area"]
[{"$f":"'Target Area Adjustments'!H62","v":0},"Net Ceiling Area"]
[{"$f":"'Target Area Adjustments'!F12","v":0},"Existing Window Area"]
[{"$f":"'Target Area Adjustments'!H12","v":0},"Existing Net AG Wall Area"]
[{"$f":"'Target Area Adjustments'!F63","v":0},"Existing Skylight Area"]
[{"$f":"'Target Area Adjustments'!H63","v":0},"Existing Net Ceiling Area"]
[]
["Flags from Env-Sum Options"]
{"$rows_left_out":170}
{"sheet":"Target Area Adjustments","index":7,"n_rows":88,"n_cols":12,"rows_kept":88,"cut":false,"hidden":false,"merged":[[67,9,68,9],[16,1,16,2]]}
[null,"Vertical Fenestration Target Area Adjustment Calculations"]
[]
[null,{"$f":"'ENV-SUM'!B3","v":"Project Title:"},null,null,{"$f":"IF('PROJ-SUM'!$D$3=\"1 - This title will copy onto other forms\",\"1 - Fill this line out on PROJ-SUM\",'PROJ-SUM'!$D$3)","v":"1 - Fill this line out on PROJ-SUM"},null,null,null,null,null,"Date",{"$f":"TEXT('PROJ-SUM'!$F$3,\"mm/dd/yyyy\")","v":"01/01/2017"}]
[]
[]
[null,null,"VF = Vertical fenestration",null,null,null,"NW = Net above grade wall (excludes fenestration and doors.)"]
[null,null,"DR = Opaque doors",null,null,null,"Gross Exterior Above-Grade Wall Area= VF + NW + DR"]
[null,null,"AG = Above-grade"]
[]
[null,"Proposed Areas",null,null,null,"Vertical Fenestration",null,"Net Above Grade Wall",null,"Opaque Door"]
[null,null,null,"Project Areas ->","VF=",{"$f":"SUM('ENV-UA'!H83:H98)","v":0},"NW=",{"$f":"SUM('ENV-UA'!H27:H44)","v":0},"DR=",{"$f":"SUM('ENV-UA'!H77:H82)","v":0}]
[null,null,null,"Existing Non-project Areas ->","VF=",{"$f":"'ENV-UA'!G11","v":0},"NW=",{"$f":"'ENV-UA'!I11","v":0}]
[null,"Gross Exterior AG Wall Area",null,"Max Vert. Fen. %\n(C402.3.1)",null,null,null,"Maximum Target Vert. Fen. Area"]
[null,{"$f":"(SUM(F11:J12))","v":0},"x",{"$f":"'TA1'!F152","v":0.3},"¸",100,"=",{"$f":"IF(altWWRunchanged,B18,B14*D14)","v":0}]
[]
{"$rows_left_out":74}
{"sheet":"ENV-SHGC","index":8,"n_rows":54,"n_cols":14,"rows_kept":54,"cut":false,"hidden":false,"merged":[[22,6,23,6],[38,6,39,6],[13,1,13,3],[14,1,14,3],[15,1,15,3],[16,1,16,3],[17,1,17,3]]}
["SHGC Calculation",null,null,null,null,null,null,null,null,"ENV-SHGC"]
[{"$f":"'ENV-SUM'!A2","v":"2015 WSEC Compliance Forms for Commercial Buildings including R2, R3, & R4 over 3 stories and all R1 "},null,null,null,null,null,null,null,null,{"$f":"'ENV-SUM'!G2","v":"Revised Oct 2017"}]
[{"$f":"'ENV-SUM'!B3","v":"Project Title:"},null,{"$f":"IF('PROJ-SUM'!$D$3=\"1 - This title will copy onto other forms\",\"1 - Fill this line out on PROJ-SUM\",'PROJ-SUM'!$D$3)","v":"1 - Fill this line out on PROJ-SUM"},null,null,null,null,"Date",{"$f":"TEXT('PROJ-SUM'!$F$3,\"mm/dd/yyyy\")","v":"01/01/2017"}]
["Target Insulation Allowance:",null,null,null,null,null,null,"For Building Department Use"]
[null,{"$f":"IF(CompliancePath<>2,\"Component Performance Not Selected\",IF(CalcType=1,\"Fully Conditioned Space - Commercial, Group R, Mixed Use\",IF(CalcType=2,\"Semi-heated Space\",IF(CalcType=3,\"Refrigerated Cooler - See note 11 on ENV-UA\",IF(CalcType=4,\"Refrigerated Freezer - See note 12 on ENV-UA\",\"\")))))","v":"Component Performance Not Selected"}]
["Fenestration Area as % gross above-grade wall area",null,null,null,{"$f":"IF('ENV-SUM'!E31>0,'ENV-SUM'!E31,0)","v":""},null,{"$f":"'Target Area Adjustments'!D14","v":0.3}]
["Skylight Area as % gross roof area",null,null,null,{"$f":"IF('ENV-SUM'!G31>0,'ENV-SUM'!G31,0)","v":""},null,{"$f":"'Target Area Adjustments'!D66","v":0.05}]
["Vertical Fenestration Alternates:",null,null,null,null,null,{"$f":"'TA1'!A28","v":"None Selected on ENV-SUM"}]
[]
[null,null,null,null,null,null,null,"User Note"]
[]
["  Skylights",null,null,null,null,"Proposed SHGC",null,"Target SHGC"]
["Sch. ID ","Provide SHGC source and fenestration schedule ID",null,null,"SHGC","x Area (A)","= SHGC x A","SHGC","x Area (A) =","SHGC x A"]
[null,null,null,null,null,null,{"$f":"IF(AND(F14=0,E14=0),0,IF(OR(F14=0,E14=0),NA(),F14*E14))","v":0},{"$f":"'TA1'!Z128","v":0.35},{"$f":"'Target Area Adjustments'!J81","v":0},{"$f":"IF(TYPE(H14*I14)<>1,0,H14*I14)","v":0}]
[null,null,null,null,null,null,{"$f":"IF(AND(F15=0,E15=0),0,IF(OR(F15=0,E15=0),NA(),F15*E15))","v":0},"SHGC",null,{"$f":"'TA1'!Z157","v":"0.35"}]
{"$rows_left_out":40}
{"sheet":"ENV-CHK","index":9,"n_rows":127,"n_cols":6,"rows_kept":127,"cut":false,"hidden":false,"merged":[[103,1,104,1],[103,2,104,2],[103,4,104,4],[103,5,104,5],[55,1,56,1],[77,4,78,4],[77,5,78,5],[85,5,86,5],[85,4,86,4],[85,2,86,2],[85,1,86,1],[83,5,84,5],[81,5,82,5],[81,4,82,4],[83,4,84,4],[92,5,95,5],[3,0,3,5],[118,0,118,5],[29,0,34,0],[29,1,34,1],[29,2,34,2],[29,4,34,4],[29,5,34,5],[46,0,48,0],[79,1,80,1],[79,2,80,2],[43,0,45,0],[43,1,45,1],[43,2,45,2],[43,4,45,4],[43,5,45,5],[40,0,42,0],[12,7,14,7],[20,5,21,5],[20,0,21,0],[20,1,21,1],[20,2,21,2],[16,2,17,2],[16,4,17,4],[16,5,17,5],[16,0,17,0],[16,1,17,1],[20,4,21,4],[12,0,14,0],[12,1,14,1],[12,2,14,2],[22,0,27,0],[46,5,48,5],[46,4,48,4],[46,2,48,2],[46,1,48,1],[22,1,27,1],[22,2,27,2],[22,4,27,4],[40,1,42,1],[40,2,42,2],[40,4,42,4],[40,5,42,5],[22,5,27,5],[88,2,91,2],[88,4,91,4],[88,5,91,5],[81,0,82,0],[81,2,82,2],[85,0,86,0],[83,2,84,2],[81,1,82,1],[83,0,84,0],[83,1,84,1],[92,4,95,4],[92,0,95,0],[92,1,95,1],[92,2,95,2],[51,0,54,0],[69,0,73,0],[69,1,73,1],[69,2,73,2],[77,1,78,1],[55,0,56,0],[61,0,63,0],[61,1,63,1],[77,2,78,2],[79,4,80,4],[88,0,91,0],[88,1,91,1],[79,5,80,5],[79,0,80,0],[51,2,54,2],[69,4,73,4],[69,5,73,5],[55,4,56,4],[55,5,56,5],[61,4,63,4],[61,5,63,5],[61,2,63,2],[55,2,56,2],[51,1,54,1],[77,0,78,0],[51,5,54,5],[51,4,54,4]]}
["Building Permit Plans Checklist, pg. 1",null,null,null,null,"ENV-CHK"]
[{"$f":"ReadMe!A2","v":"2015 WSEC Compliance Forms for Commercial Buildings including R2, R3, & R4 over 3 stories and all R1 "},null,null,null,null,{"$f":"ReadMe!B3","v":"Revised Oct 2017"}]
["Project Title:",null,{"$f":"IF('PROJ-SUM'!$D$3=\"1 - This title will copy onto other forms\",\"1 - Fill this line out on PROJ-SUM\",'PROJ-SUM'!$D$3)","v":"1 - Fill this line out on PROJ-SUM"},null,"Date",{"$f":"'ENV-SUM'!G3","v":"01/01/2017"}]
["The following information is necessary to check a building permit application for compliance with the building envelope requirements in the Washington State Energy Code, Commercial Provisions."]
["Applicability\n(yes,no,na)","Code Section","Component","Compliance information required in permit documents","Location in Documents","Building Department Notes"]
["SCOPE "]
[null,"C402.1.1","Low energy spaces","Identify low energy spaces on plans; include project information, and calculations if applicable, that demonstrate spaces are eligible for envelope provisions exemption"]
[null,"C402.1.1.1","Semi-heated spaces","Identify semi-heated spaces on plans, include calculations that demonstrate spaces are eligible for wall insulation exemption"]
[null,"C402.1.2","Equipment Buildings","Provide building area, average wall and roof U-factor, and installed equipment information that demonstrates equipment building is eligible for envelope provision exemption"]
[null,"C410.2","Walk-in and warehouse cooler and freezer spaces","Identify walk-in and warehouse cooler and freezer spaces on plans"]
[null,"C101.4.1","Mixed occupancy","Identify spaces with different occupancy requirements on plans"]
[null,"C503.2","Change of space conditioning","Identify on plans existing unconditioned spaces changing to semi-heated or conditioned space, and existing semi-heated spaces changing to conditioned space; provide calculations for existing and final level of space conditioning, and calculations that demonstrate alteration complies with current WSEC"]
[null,"C505.1","Change of occupancy","Identify on plans existing F, S and U-occupancy spaces undergoing a change in occupancy; provide calculations that demonstrate alteration complies with the current WSEC","."]
[null,null,null,"Identify on plans pre-2002 Group R spaces undergoing a change to a commercial occupancy; provide calculations that demonstrate alteration complies with the current WSEC"]
[null,null,null,"Identify on plans non-Group R occupancy spaces undergoing a change to Group R; provide calculations that demonstrate alteration complies with the current WSEC"]
{"$rows_left_out":112}